{"text_format":"1","workbook":"xlsx","n_sheets":9,"sheets":["Overview","Reporting Period","LCB 2413","LCB 2414","LCB 2415","Remittance Summary","Calculator","Distillery","MRP"],"not_rendered":{"charts":0,"images":3,"macros":1,"external_links":0,"defined_names":11,"comments":2,"pivot_tables":0},"unopened":[],"bounds":{"document_bytes":16777216,"sheet_cells":100000,"rows_first":2000,"rows_last":500,"rows_between":2000,"halvings":0,"cell_chars":16384,"cell_head_chars":4096},"cells_cut":0,"cells_raw":0,"read":"whole","date_system":"1900"}

{"sheet":"Overview","index":0,"n_rows":59,"n_cols":7,"rows_kept":59,"cut":false,"hidden":false,"merged":[[3,1,3,3],[3,6,4,9],[7,1,17,9],[58,1,63,9]]}
["Distillery Reporting Template Overview /Instructions"]
[]
["Expose Cells"]
[null,"Enter \"y\" to highlight cells that require information to be entered in all forms. For printing purposes, the \"y\" must be cleared since figures in highlighted cells may not be legible when the forms are printed. Press the \"Tab\" key to move between input cells on each form.",null,null,null,null,"\nPlease note that the email feature will only work if you have a locally installed email client such as Outlook."]
[]
["Monthly Distillery Reporting Forms"]
[]
[null,"All three report categories evident within each tab of this form, LCB 2413, LCB 2414, and LCB 2415, are required to be completed in full where applicable and the entire file is to be submitted to distilleryreporting@lcbo.com, in Excel format, no later than 20 days following the applicable month/quarter being reported upon. All submissions received by this mailbox are automatically forwarded, internally, to accounts.receivable@lcbo.com for invoicing, accounting, and receipt of payment purposes. Nil/Zero report categories, where the category may not be applicable to your organization, and nil/zero reports, in months/quarters where there may not be any sales transaction activity, are also required to be submitted. A copy of the submitted report must be retained by the Distillery for audit purposes.\n\nWithin this authorized program and sales relationship, the Distillery is acting as an agent of the LCBO, directly carrying out sales to the customer while collecting fees on behalf of the LCBO and subsequently remitting them to the LCBO. A such, the sales based on the Selling Price seen within the Calculator tab would be considered the LCBO’s revenue, while there would be a deemed wholesale sale from the Distillery to the LCBO mainly based on the LCBO’s Landed Cost, which would be considered the Distillery’s revenue. *NEW*\n\nQuestions regarding the completion/content of the report? Contact distilleryreporting@lcbo.com"]
[]
[]
[]
["SUMMARY"]
[]
[]
[]
{"$rows_left_out":45}
{"sheet":"Reporting Period","index":1,"n_rows":17,"n_cols":6,"rows_kept":17,"cut":false,"hidden":true,"merged":[]}
[null,"Format 1","Format 2","Frequency",null,"Calculator - DF Operator"]
[null,"2022-04-01","2022-04-01","MONTHLY REPORTING STARTING",null,"Non-Pearson"]
[null,"2022-05-01","2022-05-01","MONTHLY REPORTING STARTING",null,"Pearson"]
[null,"2022-06-01","2022-06-01","MONTHLY REPORTING STARTING"]
[null,"Q1 FY 2022-23","2022-06-30","QUARTERLY REPORTING ENDING"]
[null,"2022-07-01","2022-07-01","MONTHLY REPORTING STARTING"]
[null,"2022-08-01","2022-08-01","MONTHLY REPORTING STARTING"]
[null,"2022-09-01","2022-09-01","MONTHLY REPORTING STARTING"]
[null,"Q2 FY 2022-23","2022-09-30","QUARTERLY REPORTING ENDING"]
[null,"2022-10-01","2022-10-01","MONTHLY REPORTING STARTING"]
[null,"2022-11-01","2022-11-01","MONTHLY REPORTING STARTING"]
[null,"2022-12-01","2022-12-01","MONTHLY REPORTING STARTING"]
[null,"Q3 FY 2022-23","2022-12-31","QUARTERLY REPORTING ENDING"]
[null,"2023-01-01","2023-01-01","MONTHLY REPORTING STARTING"]
[null,"2023-02-01","2023-02-01","MONTHLY REPORTING STARTING"]
{"$rows_left_out":3}
{"sheet":"LCB 2413","index":2,"n_rows":41,"n_cols":10,"rows_kept":41,"cut":false,"hidden":false,"merged":[[30,3,30,5],[1,1,1,2]]}
["Distillery Container Deposit Statement"]
[null,null,null,{"$f":"IF(Overview!$A$4=\"y\",1,0)","v":0}]
[null,"Distillery Name",null,null,null,{"$f":"IFERROR(VLOOKUP('LCB 2413'!$F$2,'Reporting Period'!$C$1:$D$17,2,0),\"Select MONTH Starting or QUARTER Ending Date From List\")","v":"Select MONTH Starting or QUARTER Ending Date From List"}]
[null,"Deposits Collected by Channel",null,"Containers",null,"Deposit Value"]
[null,"Less than or equal to 100 ml ($0.00 deposit)"]
[null,"Distillery Retail Store",null,null,null,{"$f":"IF(ISNUMBER(D6),D6*0,\"\")","v":""}]
[null,"Delivered Direct to Licensees",null,{"$f":"IF(ISNUMBER('LCB 2414'!$I$15),SUMPRODUCT(('LCB 2414'!$E$21:$E$54<=0.1)*('LCB 2414'!$D$21:$D$54<>\"TH\")*('LCB 2414'!$D$21:$D$54<>\"BTG\")*(('LCB 2414'!$F$21:$F$54)*('LCB 2414'!$G$21:$G$54)+('LCB 2414'!$F$21:$F$54)*('LCB 2414'!$G$21:$G$54<1))),\"\")","v":0},null,0]
[null,"Tied-House sales",null,{"$f":"IF(ISNUMBER('LCB 2414'!$I$16),SUMPRODUCT(('LCB 2414'!$E$21:$E$54<=0.1)*('LCB 2414'!$D$21:$D$54=\"TH\")*(('LCB 2414'!$F$21:$F$54)*('LCB 2414'!$G$21:$G$54)+('LCB 2414'!$F$21:$F$54)*('LCB 2414'!$G$21:$G$54<1))),\"\")","v":0},null,0]
[null,"By the Glass",null,{"$f":"IF(ISNUMBER('LCB 2414'!$I$17),SUMPRODUCT(('LCB 2414'!$E$21:$E$54<=0.1)*('LCB 2414'!$D$21:$D$54=\"BTG\")*(('LCB 2414'!$F$21:$F$54)*('LCB 2414'!$G$21:$G$54)+('LCB 2414'!$F$21:$F$54)*('LCB 2414'!$G$21:$G$54<1))),\"\")","v":0},null,0]
[null,"Other (e.g. drs, promotional, tastings)",null,null,null,""]
[null,"Less: Refilled Containers",null,null,null,""]
[null,"Subtotal",null,{"$f":"IF((SUM(D6:D10)-D11)<>0,SUM(D6:D10)-D11,0)","v":0},null,{"$f":"IF(ISNUMBER(D12),D12*0,0)","v":0}]
[null,"Greater than 100 ml and less than or equal to 630 ml ($0.10 deposit)"]
[null,"Distillery Retail Store",null,null,null,{"$f":"IF(D14<>0,ROUNDUP(D14,0)*0.1,\"\")","v":""}]
[null,"Delivered Direct to Licensees",null,{"$f":"IF(ISNUMBER('LCB 2414'!$I$15),SUMPRODUCT(('LCB 2414'!$E$21:$E$54>0.1)*('LCB 2414'!$E$21:$E$54<=0.63)*('LCB 2414'!$D$21:$D$54<>\"TH\")*('LCB 2414'!$D$21:$D$54<>\"BTG\")*(('LCB 2414'!$F$21:$F$54)*('LCB 2414'!$G$21:$G$54)+('LCB 2414'!$F$21:$F$54)*('LCB 2414'!$G$21:$G$54<1))),\"\")","v":0},null,{"$f":"IF(ISNUMBER(D15),ROUNDUP(D15,0)*0.1,\"\")","v":0}]
{"$rows_left_out":27}
{"sheet":"LCB 2414","index":3,"n_rows":54,"n_cols":35,"rows_kept":54,"cut":false,"hidden":false,"merged":[[6,1,6,5],[7,1,7,5],[7,21,7,22]]}
[null,null,null,null,null,null,null,null,null,null,null,null,null,null,null,null,null,null,null,null,null,null,null,null,null,null,null,null,"Pricing Components","Rate","Metric",null,"Pricing Components","Rate","Metric"]
[null,null,null,null,null,null,null,null,null,null,null,null,null,null,null,null,null,null,null,null,null,null,"LCB 2414",null,null,null,null,null,{"$f":"Calculator!J3","v":"Whisky, Rum, Gin, Vodka, Liqueurs, Brandy"},{"$f":"Calculator!K3","v":1.397},"ad valorem",2,{"$f":"Calculator!J26","v":"Excise"},{"$f":"Calculator!K26","v":13.042},{"$f":"Calculator!L26","v":"per LAA"}]
["Distillery Direct Delivery Sales Report",null,null,null,null,null,null,null,null,null,null,null,null,null,null,null,null,null,null,null,null,null,"05-21",null,null,null,null,null,{"$f":"Calculator!J4","v":"One Pour / Pre-Mixed Cocktails"},{"$f":"Calculator!K4","v":0.96699999999999997},"ad valorem",3,{"$f":"Calculator!J25","v":"Cooler Excise"},{"$f":"Calculator!K25","v":0.33},"per litre"]
[null,null,null,null,null,{"$f":"'LCB 2413'!D2","v":0},null,null,null,null,null,null,null,null,null,null,null,null,null,null,null,null,null,null,null,null,null,null,null,{"$f":"Calculator!K5","v":0.68500000000000005},"ad valorem",4]
["Summary of Spirit Sales to Licensees on behalf of the LCBO",null,null,null,null,null,null,null,null,null,null,null,null,null,null,null,null,null,null,null,null,null,null,null,null,null,null,null,{"$f":"Calculator!J5","v":"Spirit Coolers"},{"$f":"Calculator!K5","v":0.68500000000000005},"ad valorem",5,"Cooler MRP",{"$f":"Calculator!K21","v":3.7789999999999999},"per litre"]
[null,null,null,null,null,null,null,null,null,null,null,null,null,null,null,null,null,null,null,null,null,null,null,null,null,null,null,null,{"$f":"Calculator!J10","v":"Volume Levy"},{"$f":"Calculator!K10","v":0.38},"per litre",6,"Cooler MRP",{"$f":"Calculator!K22","v":3.8340000000000001},"per litre"]
["Ontario Distillery Name",{"$f":"IF(ISBLANK('LCB 2413'!B2:C2),\"\",'LCB 2413'!B2:C2)","v":""},null,null,null,null,null,null,null,null,null,null,null,null,null,null,null,null,null,null,null,null,null,null,null,null,null,null,"Cooler Bottle Levy",{"$f":"Calculator!K11","v":0.28000000000000003},"per litre",7,"Cooler MRP",{"$f":"Calculator!K23","v":3.9350000000000001},"per litre"]
["HST Registration#",null,null,null,null,null,null,null,null,{"$f":"'LCB 2413'!D2","v":0},null,null,null,null,null,null,null,null,null,null,{"$f":"IF(ISBLANK('LCB 2413'!$F$2),\"\",'LCB 2413'!$F$3)","v":""},{"$f":"IF(ISBLANK('LCB 2413'!$F$2),\"\",'LCB 2413'!$F$2)","v":""},null,null,null,null,null,null,"Environmental Fee",{"$f":"Calculator!K12","v":8.9300000000000004E-2},"per bottle",8,"Cooler MRP",{"$f":"Calculator!K24","v":73.064999999999998},"per litre"]
[null,null,null,null,null,null,null,null,"Note: Print form button must be used if entries exceed one page (row 41).",null,null,null,null,null,null,null,null,null,null,null,null,"REPORTING PERIOD",null,null,null,null,null,null,"Bottle Deposit <=630ml",{"$f":"Calculator!K13","v":0.1},"per bottle",9]
["Product Categories:","Licensee Type:",null,null,null,null,null,null,null,null,null,null,null,null,null,null,null,null,null,null,null,null,null,null,null,null,null,null,"Bottle Deposit >630ml",{"$f":"Calculator!K14","v":0.2},"per bottle",10]
["Whisky = W             Liqueur = L","Licensees = Blank or Any Value ≠ TH or BTG",null,null,null,null,null,null,null,null,null,null,null,null,null,null,null,null,null,null,null,null,null,null,null,null,null,null,{"$f":"Calculator!J15","v":"Direct Delivery Rebate"},{"$f":"Calculator!K15","v":0.2},"ad valorem",11]
["Rum = R                   Vodka = V","Tied-House  = TH",null,null,null,null,null,null,null,null,null,null,null,null,null,null,null,null,null,null,null,null,null,null,null,null,null,null,"Licensee Markup",{"$f":"Calculator!K16","v":0},"ad valorem",12]
["Gin = G                     Brandy = B","By the Glass = BTG",null,null,null,null,null,null,null,null,null,null,null,null,null,null,null,null,null,null,null," ",null,null,null,null,null,null,{"$f":"Calculator!J17","v":"Licensee Discount"},{"$f":"Calculator!K17","v":0.1},"ad valorem",13]
["One Pour / Pre-Mix Cocktails = P","Grand Total",null,null,null,{"$f":"IF(SUM($F$21:$F$54)<>0,ROUND(SUM(F$21:F$54),0),0)","v":0},null," ",{"$f":"IF(SUM($I$21:$I$54)<>0,ROUND(SUM(I$21:I$54),0),0)","v":0},{"$f":"IF(SUM($F$21:$F$54)<>0,ROUND(SUM(J$21:J$54),2),0)","v":0},null,{"$f":"IF(SUM($F$21:$F$54)<>0,ROUND(SUM(L$21:L$54),2),0)","v":0},0,0,0,0,0,0,0,0,0,0,0,null,null,null,{"$f":"ISNUMBER(Z14)","v":false},null,{"$f":"Calculator!J18","v":"HST (GST Portion)"},{"$f":"Calculator!K18","v":0.05},"ad valorem",14]
["Coolers = C","Licensees Subtotal",null,null,null,{"$f":"IF(SUM($F$21:$F$54)<>0,ROUND(F14-F16-F17,0),0)","v":0},null,null,{"$f":"IF(SUM($F$21:$F$54)<>0,ROUND(I14-I16-I17,0),0)","v":0},{"$f":"IF(SUM($F$21:$F$54)<>0,ROUND(J14-J16-J17,2),0)","v":0},null,{"$f":"IF(SUM($F$21:$F$54)<>0,ROUND(L14-L16-L17,2),0)","v":0},{"$f":"IF(SUM($F$21:$F$54)<>0,ROUND(M14-M16-M17,2),0)","v":0},0,{"$f":"IF(SUM($F$21:$F$54)<>0,ROUND(O14-O16,2),0)","v":0},{"$f":"IF(SUM($F$21:$F$54)<>0,ROUND(P14-P16-P17,2),0)","v":0},{"$f":"IF(SUM($F$21:$F$54)<>0,ROUND(Q14-Q16-Q17,2),0)","v":0},0,0,0,0,0,{"$f":"IF(SUM($F$21:$F$54)<>0,ROUND(W14-W16-W17,2),0)","v":0},null,null,null,null,null,{"$f":"Calculator!J19","v":"HST (PST Portion)"},{"$f":"Calculator!K19","v":0.08},"ad valorem",15]
{"$rows_left_out":40}
{"sheet":"LCB 2415","index":4,"n_rows":52,"n_cols":19,"rows_kept":52,"cut":false,"hidden":false,"merged":[[8,1,8,5],[8,18,8,19]]}
[]
[]
[null,null,null,null,null,null,null,null,null,null,null,null,null,null,null,null,null,null,"LCB 2415"]
[null,null,null,null,null,null,null,null,null,null,null,null,null,null,null,null,null,null,{"$f":"'LCB 2414'!W3","v":"05-21"}]
["Distillery Duty Free Sales Report"]
[]
["Summary of Ontario spirit sales made to Duty Free Operators on behalf of the LCBO"]
[]
["Ontario Winery Name",{"$f":"IF(ISBLANK('LCB 2413'!B2:C2),\"\",'LCB 2413'!B2:C2)","v":""},null,null,null,null,null,null,null,null,null,null,null,null,null,null,null,{"$f":"IF(ISBLANK('LCB 2413'!$F$2),\"\",'LCB 2413'!$F$3)","v":""},{"$f":"IF(ISBLANK('LCB 2413'!$F$2),\"\",'LCB 2413'!$F$2)","v":""}]
[null,null,null,null,null,null,null,null,null,null,null,null,null,null,null,null,null,null,"REPORTING PERIOD"]
[null,{"$f":"'LCB 2413'!D2","v":0},null,"Note: Print form button must be used if entries exceed one page (row 44)."]
["Product Categories:"]
["Whisky = W, Rum = R, Gin = G, Vodka = V, Liqueur = L,"]
["Brandy = B, One Pour/Pre-Mix Cocktails = P, Coolers = C"]
[null,null,null,"Totals",null,null,{"$f":"J15","v":0},{"$f":"IF(SUM(H19:H52)<>0,SUM(H19:H52),0)","v":0},null,{"$f":"IF(SUM(J19:J52)<>0,SUM(J19:J52),0)","v":0},null,{"$f":"IF(SUM(L19:L52)<>0,ROUND(SUM(L19:L52),3),0)","v":0},null,null,{"$f":"IF(SUM(O19:O52)<>0,ROUND(SUM(O19:O52),2),0)","v":0},{"$f":"IF(SUM(P19:P52)<>0,SUM(P19:P52),0)","v":0},{"$f":"IF(SUM(Q19:Q52)<>0,ROUND(SUM(Q19:Q52),2),0)","v":0},{"$f":"IF(SUM(R19:R52)<>0,ROUND(SUM(R19:R52),2),0)","v":0},{"$f":"IF(SUM(S19:S52)<>0,ROUND(SUM(S19:S52),2),0)","v":0}]
{"$rows_left_out":38}
{"sheet":"Remittance Summary","index":5,"n_rows":29,"n_cols":3,"rows_kept":29,"cut":false,"hidden":false,"merged":[]}
["Remittance Summary"]
[]
[]
[{"$f":"IF(ISBLANK('LCB 2413'!B2),\"\",'LCB 2413'!B2)","v":""},null,{"$f":"IF(ISBLANK('LCB 2413'!F2),\"\",'LCB 2413'!F2)","v":""}]
["Distillery Name",null,{"$f":"IF(ISBLANK('LCB 2413'!$F$2),\"REPORTING PERIOD\",'LCB 2413'!$F$3)","v":"REPORTING PERIOD"}]
[]
["LCBO Remittances:",null,"$ Amount"]
["Direct Delivery Sales Report (LCB 2414)",null,{"$f":"'LCB 2414'!W14","v":0}]
["Duty Free Sales Report (LCB 2415)",null,{"$f":"'LCB 2415'!S15","v":0}]
["Container Deposit Statement (LCB 2413)",null,{"$f":"'LCB 2413'!F29","v":0}]
["Total LCBO Payment",null,{"$f":"SUM(C8:C10)","v":0}]
[]
["HST on Direct Delivery to Licensee Sales:",null,"$ Amount"]
["HST on LCBO's Sales administered by Distillery (LCB 2414)",null,{"$f":"'LCB 2414'!$Q$14","v":0}]
["HST Collected on Distillery's Deemed Wholesale Sale to LCBO (LCB 2414)",null,{"$f":"'LCB 2414'!$R$14","v":0}]
{"$rows_left_out":15}
{"sheet":"Calculator","index":6,"n_rows":44,"n_cols":12,"rows_kept":44,"cut":false,"hidden":false,"merged":[[1,0,3,0],[1,1,3,1]]}
[]
["Whisky, Rum, Gin, Vodka, Brandy = Blank; Liqueur = L ; Cooler = C; One Pour/Pre-Mix Cocktails = P",null,null,null,null,null,null,null,null,"Pricing Components","Rate","Metric"]
[null,null,null,null,null,null,null,null,null,"Whisky, Rum, Gin, Vodka, Liqueurs, Brandy",1.397,"ad valorem"]
[null,null,null,null,null,null,null,null,null,"One Pour / Pre-Mixed Cocktails",0.96699999999999997,"ad valorem"]
["Bottle Size (L)",0.75,null,null,null,null,null,null,null,"Spirit Coolers",0.68500000000000005,"ad valorem"]
["Alcohol Content %",0.4,null,null,null,null,null,null,null,"Pearson Duty Free Spirits (Excluding coolers)",0.3,"ad valorem"]
["Bottles per Selling Unit",1,null,null,null,null,null,null,null,"Non-Pearson Duty Free Spirits (Excluding coolers)",0.2,"ad valorem"]
["Retail selling price (including deposit)",28.2,null,null,null,null,null,null,null,"Duty Free Spirit Coolers",0.15,"ad valorem"]
["Minimum Retail Price Check",{"$f":"IF(AND(B2=\"L\",$B$13<CEILING(VLOOKUP(B5*1000,MRP!$A$3:$C$43,3)/VLOOKUP(B5*1000,MRP!$A$3:$C$43,1)*B5*1000,0.05)),\"Below MRP\",IF(AND(ISBLANK(B2),B13<CEILING(VLOOKUP(B5*1000,MRP!$A$3:$C$43,2)/VLOOKUP(B5*1000,MRP!$A$3:$C$43,1)*B5*1000,0.05)),\"Below MRP\",IF(OR(B2=\"c\",B2=\"p\"),D9,\"Okay\")))","v":"Below MRP"},null,{"$f":"IF(AND(OR($B$2=\"c\",$B$2=\"p\"),$B$6<4.1%,D13-D14<CEILING($K$21*$B$5*$B$7+$B$7*$K$12*(1+$K$18+$K$19+$K$20),0.05)),\"Below MRP\",IF(AND(OR($B$2=\"c\",$B$2=\"p\"),$B$6>=4.1%,$B$6<4.9%,D13-D14<CEILING($K$22*$B$5*$B$7+$B$7*$K$12*(1+$K$18+$K$19+$K$20),0.05)),\"Below MRP\",IF(AND(OR($B$2=\"c\",$B$2=\"p\"),$B$6>=4.9%,$B$6<5.6%,D13-D14<CEILING($K$23*$B$5*$B$7+$B$7*$K$12*(1+$K$18+$K$19+$K$20),0.05)),\"Below MRP\",IF(AND(OR($B$2=\"c\",$B$2=\"p\"),$B$6>=5.6%,D13-D14<CEILING($K$24*$B$5*$B$6*$B$7+$B$7*$K$12*(1+$K$18+$K$19+$K$20),0.05)),\"Below MRP\",\"Okay\"))))","v":"Okay"},null,null,null,null,null,"Spirits Basic Tax",0.61499999999999999,"ad valorem"]
["Duty Free Operator","Non-Pearson",null,null,null,null,null,null,null,"Volume Levy",0.38,"per litre"]
[{"$f":"IF(Overview!$A$4=\"y\",1,0)","v":0},"LCBO",null,"Distillery Retail Store (DRS)",null,"Direct Delivery to Licensee",null,"Direct Delivery to Duty Free",null,"Cooler Volume Levy",0.28000000000000003,"per litre"]
[null,null,null,null,null,null,null,null,null,"Environmental Fee",8.9300000000000004E-2,"per container"]
["Selling Price",{"$f":"B8","v":28.2},null,{"$f":"B13","v":28.2},null,{"$f":"F16+F15+F14","v":25.399999999999995},null,{"$f":"H16+H15+H14","v":7.5223824089846865},null,"Container Deposit >100 mL and <=630 mL",0.1,"per container"]
["Container Deposit",{"$f":"IF(AND(B5>=18,OR(B2=\"c\",B2=\"d\")),0,IF(B5<=0.1,0,IF(B5>0.63,$B$7*$K$14,$B$7*$K$13)))","v":0.2},null,{"$f":"B14","v":0.2},null,{"$f":"B14","v":0.2},null,0,null,"Container Deposit >630 mL",0.2,"per container"]
["H.S.T.",{"$f":"(B$13-B14)/(1+$K$18+$K$19)*($K$18+$K$19)","v":3.221238938053097},null,{"$f":"ROUND(B15,2)","v":3.22},null,{"$f":"F16*($K$18+$K$19)","v":2.8991150442477873},null,0,null,"Direct Delivery Rebate",0.2,"ad valorem"]
{"$rows_left_out":30}
{"sheet":"Distillery","index":7,"n_rows":161,"n_cols":2,"rows_kept":161,"cut":false,"hidden":true,"merged":[]}
[{"$f":"TEXT('LCB 2413'!F2,\"mmmyy\")","v":"Jan00"},{"$f":"VLOOKUP('LCB 2413'!B2,Distillery!$A$3:$B$161,2,FALSE)","v":{"$error":"#N/A"}}]
["Distillery","Filename"]
["1000 Islands Distillery Inc.","1000Islands"]
["361 Degrees Inc.","361Degrees"]
["786 Country Squire Distillery","786Country"]
["Ace Beverage Group Inc.","Ace"]
["ACEONE SPIRITS INC.","AceoneSpirits"]
["Alo Food Group","AloFood"]
["Aro Beverage Company","AroBeverage"]
["Artist in Residence","ArtistinRes"]
["Aware Beverages","Aware"]
["BACARDI CANADA INC.","BacardiCanada"]
["BARCHEF Project","Barchef"]
["Barnstormer Brewing Co.","Barnstormer"]
["Bayfield Berry Farm","Bayfield"]
{"$rows_left_out":147}
{"sheet":"MRP","index":8,"n_rows":47,"n_cols":6,"rows_kept":47,"cut":false,"hidden":false,"merged":[[5,4,6,4],[5,5,6,5]]}
["Minimum Retail Price for Class A & Class B Spirits",null,null,null,"Baseline Rates for Low Alcohol Spirits & Coolers"]
["Container size (mL)","Class A","Class B",null,"Low Alcohol Spirits & Coolers","Baseline Rates"]
[40,2.7,1.75,null,"Less than 4.1%","$3.779 per litre"]
[50,3.4000000000000004,2,null,"4.1 to less than 4.9%","$3.834 per litre"]
[60,4.25,2.3000000000000003,null,"4.9 to less than 5.6%","$3.935 per litre"]
[100,4.7,2.85,null,"5.6% up to and including 7%","$73.065 per litre of absolute alcohol as defined in Division 2 of the Food and Drug Regulations"]
[120,5.5,3.8000000000000003]
[150,6.9,4.6499999999999995,null,"Notes:"]
[180,8.1999999999999993,5.35,null,"The minimum retail price for spirits (5.6% or more) and coolers (5.6% up to and including 7%)"]
[200,9.1,5.9,null," is the baseline rate per litre, plus container deposit, plus the environmental levy ($0.0893)"]
[250,10.8,7,null,"per non-refillable container, plus an amount equal to the HST (13%) and 4% of the"]
[280,12.200000000000001,7.7,null,"  of the environmental levy."]
[300,13,8.35]
[350,15.1,9.65]
[360,15.5,10.050000000000001]
{"$rows_left_out":32}